Reaction Details
TargetDelta-type opioid receptor
LigandBDBM50154214
Substrate/Competitorn/a
Meas. Tech.ChEMBL_303501 (CHEMBL839973)
Ki 472±n/a nM
Citation Grundt, PWilliams, IALewis, JWHusbands, SM Identification of a new scaffold for opioid receptor antagonism based on the 2-amino-1,1-dimethyl-7-hydroxytetralin pharmacophore. J Med Chem47:5069-75 (2004) 
 
Delta-type opioid receptor
Name:Delta-type opioid receptor
Type:G Protein-Coupled Receptor (GPCR)
Mol. Mass.:40382.98
Organism:Homo sapiens (Human)
Description:Competition binding assays were carried out using membrane preparations from transfected HN9.10 cells that constitutively expressed the delta opioid receptor.
Residue:372
BDBM50154214
NameBDBM50154214
Synonyms:8,8-dimethyl-7-{[(2E)-3-phenylprop-2-enyl]amino}-5,6,7,8-tetrahydronaphthalen-2-ol | CHEMBL189243
TypeSmall organic molecule
Emp. Form.C21H25NO
Mol. Mass.307.4293
SMILESCC1(C)C(CCc2ccc(O)cc12)NC\C=C\c1ccccc1