Reaction Details
TargetDelta-type opioid receptor
LigandBDBM50154199
Substrate/Competitorn/a
Meas. Tech.ChEMBL_303501 (CHEMBL839973)
Ki 601±n/a nM
Citation Grundt, PWilliams, IALewis, JWHusbands, SM Identification of a new scaffold for opioid receptor antagonism based on the 2-amino-1,1-dimethyl-7-hydroxytetralin pharmacophore. J Med Chem47:5069-75 (2004) 
 
Delta-type opioid receptor
Name:Delta-type opioid receptor
Type:G Protein-Coupled Receptor (GPCR)
Mol. Mass.:40382.98
Organism:Homo sapiens (Human)
Description:Competition binding assays were carried out using membrane preparations from transfected HN9.10 cells that constitutively expressed the delta opioid receptor.
Residue:372
BDBM50154199
NameBDBM50154199
Synonyms:7-[(cyclopropylmethyl)(methyl)amino]-8,8-dimethyl-5,6,7,8-tetrahydronaphthalen-2-ol | CHEMBL365228
TypeSmall organic molecule
Emp. Form.C17H25NO
Mol. Mass.259.3865
SMILESCN(CC1CC1)C1CCc2ccc(O)cc2C1(C)C