Reaction Details
TargetKappa-type opioid receptor
LigandBDBM50154205
Substrate/Competitorn/a
Meas. Tech.ChEMBL_303480 (CHEMBL838854)
Ki 184±n/a nM
Citation Grundt, PWilliams, IALewis, JWHusbands, SM Identification of a new scaffold for opioid receptor antagonism based on the 2-amino-1,1-dimethyl-7-hydroxytetralin pharmacophore. J Med Chem47:5069-75 (2004) 
 
Kappa-type opioid receptor
Name:Kappa-type opioid receptor
Type:G Protein-Coupled Receptor (GPCR)
Mol. Mass.:42648.76
Organism:Homo sapiens (Human)
Description:P41145
Residue:380
BDBM50154205
NameBDBM50154205
Synonyms:8,8-dimethyl-7-[methyl(propyl)amino]-5,6,7,8-tetrahydronaphthalen-2-ol | CHEMBL186154
TypeSmall organic molecule
Emp. Form.C16H25NO
Mol. Mass.247.3758
SMILESCCCN(C)C1CCc2ccc(O)cc2C1(C)C