Reaction Details
TargetKappa-type opioid receptor
LigandBDBM50154212
Substrate/Competitorn/a
Meas. Tech.ChEMBL_303480 (CHEMBL838854)
Ki 552±n/a nM
Citation Grundt, PWilliams, IALewis, JWHusbands, SM Identification of a new scaffold for opioid receptor antagonism based on the 2-amino-1,1-dimethyl-7-hydroxytetralin pharmacophore. J Med Chem47:5069-75 (2004) 
 
Kappa-type opioid receptor
Name:Kappa-type opioid receptor
Type:G Protein-Coupled Receptor (GPCR)
Mol. Mass.:42648.76
Organism:Homo sapiens (Human)
Description:P41145
Residue:380
BDBM50154212
NameBDBM50154212
Synonyms:7-(dipropylamino)-8,8-dimethyl-5,6,7,8-tetrahydronaphthalen-2-ol | CHEMBL365410
TypeSmall organic molecule
Emp. Form.C18H29NO
Mol. Mass.275.429
SMILESCCCN(CCC)C1CCc2ccc(O)cc2C1(C)C