Reaction Details
TargetKappa-type opioid receptor
LigandBDBM50154200
Substrate/Competitorn/a
Meas. Tech.ChEMBL_303480 (CHEMBL838854)
Ki 149±n/a nM
Citation Grundt, PWilliams, IALewis, JWHusbands, SM Identification of a new scaffold for opioid receptor antagonism based on the 2-amino-1,1-dimethyl-7-hydroxytetralin pharmacophore. J Med Chem47:5069-75 (2004) 
 
Kappa-type opioid receptor
Name:Kappa-type opioid receptor
Type:G Protein-Coupled Receptor (GPCR)
Mol. Mass.:42648.76
Organism:Homo sapiens (Human)
Description:P41145
Residue:380
BDBM50154200
NameBDBM50154200
Synonyms:7-amino-6-methoxy-8,8-dimethyl-5,6,7,8-tetrahydronaphthalen-2-ol | CHEMBL187635
TypeSmall organic molecule
Emp. Form.C13H19NO2
Mol. Mass.221.2955
SMILESCO[C@H]1Cc2ccc(O)cc2C(C)(C)[C@@H]1N