Reaction Details
TargetKappa-type opioid receptor
LigandBDBM50154214
Substrate/Competitorn/a
Meas. Tech.ChEMBL_303480 (CHEMBL838854)
Ki 82±n/a nM
Citation Grundt, PWilliams, IALewis, JWHusbands, SM Identification of a new scaffold for opioid receptor antagonism based on the 2-amino-1,1-dimethyl-7-hydroxytetralin pharmacophore. J Med Chem47:5069-75 (2004) 
 
Kappa-type opioid receptor
Name:Kappa-type opioid receptor
Type:G Protein-Coupled Receptor (GPCR)
Mol. Mass.:42648.76
Organism:Homo sapiens (Human)
Description:P41145
Residue:380
BDBM50154214
NameBDBM50154214
Synonyms:8,8-dimethyl-7-{[(2E)-3-phenylprop-2-enyl]amino}-5,6,7,8-tetrahydronaphthalen-2-ol | CHEMBL189243
TypeSmall organic molecule
Emp. Form.C21H25NO
Mol. Mass.307.4293
SMILESCC1(C)C(CCc2ccc(O)cc12)NC\C=C\c1ccccc1