Reaction Details
TargetCarbonic anhydrase 2
LigandBDBM50154325
Substrate/Competitorn/a
Meas. Tech.ChEMBL_302417 (CHEMBL828821)
Ki 4±n/a nM
Citation Innocenti, ACasini, AAlcaro, MCPapini, AMScozzafava, ASupuran, CT Carbonic anhydrase inhibitors: the first on-resin screening of a 4-sulfamoylphenylthiourea library. J Med Chem47:5224-9 (2004) 
 
Carbonic anhydrase 2
Name:Carbonic anhydrase 2
Type:Enzyme
Mol. Mass.:29250.71
Organism:Homo sapiens (Human)
Description:P00918
Residue:260
BDBM50154325
NameBDBM50154325
Synonyms:(S)-4-Methylsulfanyl-2-[3-(4-sulfamoyl-phenyl)-thioureido]-butyric acid | CHEMBL189346
TypeSmall organic molecule
Emp. Form.C12H17N3O4S3
Mol. Mass.363.476
SMILESCSCC[C@H](NC(=S)Nc1ccc(cc1)S(N)(=O)=O)C(O)=O