Reaction Details
TargetCarbonic anhydrase 1
LigandBDBM50154333
Substrate/Competitorn/a
Meas. Tech.ChEMBL_302403 (CHEMBL875202)
Ki 110±n/a nM
Citation Innocenti, ACasini, AAlcaro, MCPapini, AMScozzafava, ASupuran, CT Carbonic anhydrase inhibitors: the first on-resin screening of a 4-sulfamoylphenylthiourea library. J Med Chem47:5224-9 (2004) 
 
Carbonic anhydrase 1
Name:Carbonic anhydrase 1
Type:Enzyme
Mol. Mass.:28873.37
Organism:Homo sapiens (Human)
Description:P00915
Residue:261
BDBM50154333
NameBDBM50154333
Synonyms:(S)-1-(4-Sulfamoyl-phenylthiocarbamoyl)-pyrrolidine-2-carboxylic acid | CHEMBL189606
TypeSmall organic molecule
Emp. Form.C12H15N3O4S2
Mol. Mass.329.395
SMILESNS(=O)(=O)c1ccc(NC(=S)N2CCC[C@H]2C(O)=O)cc1