Reaction Details
TargetCarbonic anhydrase 1
LigandBDBM50154330
Substrate/Competitorn/a
Meas. Tech.ChEMBL_302403 (CHEMBL875202)
Ki 47±n/a nM
Citation Innocenti, ACasini, AAlcaro, MCPapini, AMScozzafava, ASupuran, CT Carbonic anhydrase inhibitors: the first on-resin screening of a 4-sulfamoylphenylthiourea library. J Med Chem47:5224-9 (2004) 
 
Carbonic anhydrase 1
Name:Carbonic anhydrase 1
Type:Enzyme
Mol. Mass.:28873.37
Organism:Homo sapiens (Human)
Description:P00915
Residue:261
BDBM50154330
NameBDBM50154330
Synonyms:(S)-3-(1H-Indol-3-yl)-2-[3-(4-sulfamoyl-phenyl)-thioureido]-propionic acid | CHEMBL188191
TypeSmall organic molecule
Emp. Form.C18H18N4O4S2
Mol. Mass.418.49
SMILESNS(=O)(=O)c1ccc(NC(=S)N[C@@H](Cc2c[nH]c3ccccc23)C(O)=O)cc1