Reaction Details
TargetCarbonic anhydrase 1
LigandBDBM50154322
Substrate/Competitorn/a
Meas. Tech.ChEMBL_302403 (CHEMBL875202)
Ki 197±n/a nM
Citation Innocenti, ACasini, AAlcaro, MCPapini, AMScozzafava, ASupuran, CT Carbonic anhydrase inhibitors: the first on-resin screening of a 4-sulfamoylphenylthiourea library. J Med Chem47:5224-9 (2004) 
 
Carbonic anhydrase 1
Name:Carbonic anhydrase 1
Type:Enzyme
Mol. Mass.:28873.37
Organism:Homo sapiens (Human)
Description:P00915
Residue:261
BDBM50154322
NameBDBM50154322
Synonyms:1-(4-Sulfamoyl-phenylthiocarbamoyl)-pyrrolidine-2-carboxylic acid (S)-methylcarbamoylmethyl with resin | CHEMBL365698
TypeSmall organic molecule
Emp. Form.C15H20N4O5S2
Mol. Mass.400.473
SMILESCNC(=O)COC(=O)[C@@H]1CCCN1C(=S)Nc1ccc(cc1)S(N)(=O)=O