Reaction Details
TargetAdenosine receptor A1
LigandBDBM21220
Substrate/Competitorn/a
Meas. Tech.ChEMBL_303191 (CHEMBL829685)
Ki 18.2±n/a nM
Citation Baraldi, PGFruttarolo, FTabrizi, MARomagnoli, RPreti, DBovero, APineda de Las Infantas, MJMoorman, AVarani, KBorea, PA Synthesis and biological evaluation of novel N6-[4-(substituted)sulfonamidophenylcarbamoyl]adenosine-5'-uronamides as A3 adenosine receptor agonists. J Med Chem47:5535-40 (2004) 
 
Adenosine receptor A1
Name:Adenosine receptor A1
Type:G Protein-Coupled Receptor (GPCR)
Mol. Mass.:36520.92
Organism:Homo sapiens (Human)
Description:P30542
Residue:326
BDBM21220
NameBDBM21220
Synonyms:(2S,3S,4R,5R)-5-(6-amino-9H-purin-9-yl)-N-ethyl-3,4-dihydroxyoxolane-2-carboxamide Adenosine, N6-Ethyl-carboxamido CHEMBL464859 NECA
TypeAntineoplastic Agent
Emp. Form.C12H16N6O4
Mol. Mass.308.2932
SMILESCCNC(=O)[C@H]1O[C@H]([C@H](O)[C@@H]1O)n1cnc2c(N)ncnc12