Reaction Details
TargetTransporter
LigandBDBM50156052
Substrate/Competitorn/a
Meas. Tech.ChEMBL_303717 (CHEMBL829052)
Ki 0.680±n/a nM
Citation Zhou, JHe, RJohnson, KMYe, YKozikowski, AP Piperidine-based nocaine/modafinil hybrid ligands as highly potent monoamine transporter inhibitors: efficient drug discovery by rational lead hybridization. J Med Chem47:5821-4 (2004) 
 
Transporter
Name:Transporter
Type:PROTEIN
Mol. Mass.:66787.87
Organism:Rattus norvegicus
Description:ChEMBL_1463061
Residue:597
BDBM50156052
NameBDBM50156052
Synonyms:2-[4-(4-Chloro-phenyl)-1-methyl-piperidin-3-ylmethylsulfanyl]-1-piperidin-1-yl-ethanone | CHEMBL191330
TypeSmall organic molecule
Emp. Form.C20H29ClN2OS
Mol. Mass.380.975
SMILESCN1CCC(C(CSCC(=O)N2CCCCC2)C1)c1ccc(Cl)cc1