Reaction Details
TargetGag-Pol polyprotein [489-587]
LigandBDBM50156138
Substrate/Competitorn/a
Meas. Tech.ChEMBL_302776 (CHEMBL838839)
Ki 0.6±n/a nM
Citation Shuman, CFVrang, LDanielson, UH Improved structure-activity relationship analysis of HIV-1 protease inhibitors using interaction kinetic data. J Med Chem47:5953-61 (2004) 
 
Gag-Pol polyprotein [489-587]
Name:Gag-Pol polyprotein [489-587]
Type:Enzyme Subunit
Mol. Mass.:10781.16
Organism:Human immunodeficiency virus type 1
Description:P04585[489-587]
Residue:99
BDBM50156138
NameBDBM50156138
Synonyms:2,3-Dihydroxy-1,4-bis-(2-hydroxy-indan-1-ylcarbamoyl)-4-phenoxy-butan-1-ol anion
TypeSmall organic molecule
Emp. Form.C30H31N2O8
Mol. Mass.547.5763
SMILESO[C@H]([C@@H](O)[C@@H](Oc1ccccc1)C(=O)NC1[C@@H](O)Cc2ccccc12)[C@@H]([O-])C(=O)NC1[C@@H](O)Cc2ccccc12