Reaction Details
TargetGag-Pol polyprotein [489-587]
LigandBDBM50156139
Substrate/Competitorn/a
Meas. Tech.ChEMBL_302776 (CHEMBL838839)
Ki 5000±n/a nM
Citation Shuman, CFVrang, LDanielson, UH Improved structure-activity relationship analysis of HIV-1 protease inhibitors using interaction kinetic data. J Med Chem47:5953-61 (2004) 
 
Gag-Pol polyprotein [489-587]
Name:Gag-Pol polyprotein [489-587]
Type:Enzyme Subunit
Mol. Mass.:10781.16
Organism:Human immunodeficiency virus type 1
Description:P04585[489-587]
Residue:99
BDBM50156139
NameBDBM50156139
Synonyms:3,4-Dihydroxy-1,6-bis-[3-(4-hydroxy-phenyl)-2-methyl-propionylamino]-1,6-dioxo-5-phenoxy-hexan-2-ol anion
TypeSmall organic molecule
Emp. Form.C32H35N2O10
Mol. Mass.607.6282
SMILESC[C@@H](Cc1ccc(O)cc1)C(=O)NC(=O)[C@H]([O-])[C@H](O)[C@@H](O)[C@@H](Oc1ccccc1)C(=O)NC(=O)[C@@H](C)Cc1ccc(O)cc1