Reaction Details
TargetGag-Pol polyprotein [489-587]
LigandBDBM578
Substrate/Competitorn/a
Meas. Tech.ChEMBL_302137 (CHEMBL841761)
Kd 0.1±n/a nM
Citation Shuman, CFVrang, LDanielson, UH Improved structure-activity relationship analysis of HIV-1 protease inhibitors using interaction kinetic data. J Med Chem47:5953-61 (2004) 
 
Gag-Pol polyprotein [489-587]
Name:Gag-Pol polyprotein [489-587]
Type:Enzyme Subunit
Mol. Mass.:10781.16
Organism:Human immunodeficiency virus type 1
Description:P04585[489-587]
Residue:99
BDBM578
NameBDBM578
Synonyms:(2S)-N-[(2S,4S,5S)-5-[2-(2,6-dimethylphenoxy)acetamido]-4-hydroxy-1,6-diphenylhexan-2-yl]-3-methyl-2-(2-oxo-1,3-diazinan-1-yl)butanamide Aluviran LPV | Lopinavir
TypeSmall organic molecule
Emp. Form.C37H48N4O5
Mol. Mass.628.8008
SMILESCC(C)[C@H](N1CCCNC1=O)C(=O)N[C@H](C[C@H](O)[C@H](Cc1ccccc1)NC(=O)COc1c(C)cccc1C)Cc1ccccc1