Reaction Details
TargetGag-Pol polyprotein [489-587]
LigandBDBM50156143
Substrate/Competitorn/a
Meas. Tech.ChEMBL_302137 (CHEMBL841761)
Kd 17.5±n/a nM
Citation Shuman, CFVrang, LDanielson, UH Improved structure-activity relationship analysis of HIV-1 protease inhibitors using interaction kinetic data. J Med Chem47:5953-61 (2004) 
 
Gag-Pol polyprotein [489-587]
Name:Gag-Pol polyprotein [489-587]
Type:Enzyme Subunit
Mol. Mass.:10781.16
Organism:Human immunodeficiency virus type 1
Description:P04585[489-587]
Residue:99
BDBM50156143
NameBDBM50156143
Synonyms:1,6-Bis-(2,3-dimethyl-butyrylamino)-3,4-dihydroxy-5-[4-(2-hydroxy-3-oxo-cyclohex-1-enyl)-phenoxy]-1,6-dioxo-hexan-2-ol anion
TypeSmall organic molecule
Emp. Form.C30H41N2O10
Mol. Mass.589.6545
SMILESCC(C)[C@H](C)C(=O)NC(=O)[C@H]([O-])[C@H](O)[C@@H](O)[C@@H](Oc1ccc(cc1)C1CCCC(=O)C1=O)C(=O)NC(=O)[C@@H](C)C(C)C