Reaction Details
TargetGag-Pol polyprotein [489-587]
LigandBDBM50156150
Substrate/Competitorn/a
Meas. Tech.ChEMBL_302776 (CHEMBL838839)
Ki 2400±n/a nM
Citation Shuman, CFVrang, LDanielson, UH Improved structure-activity relationship analysis of HIV-1 protease inhibitors using interaction kinetic data. J Med Chem47:5953-61 (2004) 
 
Gag-Pol polyprotein [489-587]
Name:Gag-Pol polyprotein [489-587]
Type:Enzyme Subunit
Mol. Mass.:10781.16
Organism:Human immunodeficiency virus type 1
Description:P04585[489-587]
Residue:99
BDBM50156150
NameBDBM50156150
Synonyms:1,6-Bis-(2,3-dimethyl-butyrylamino)-5-ethoxy-3,4-dihydroxy-1,6-dioxo-hexan-2-ol anion
TypeSmall organic molecule
Emp. Form.C20H35N2O8
Mol. Mass.431.501
SMILESCCO[C@H]([C@H](O)[C@@H](O)[C@@H]([O-])C(=O)NC(=O)[C@@H](C)C(C)C)C(=O)NC(=O)[C@@H](C)C(C)C