Reaction Details
TargetGag-Pol polyprotein [489-587]
LigandBDBM50029770
Substrate/Competitorn/a
Meas. Tech.ChEMBL_302137 (CHEMBL841761)
Kd 577±n/a nM
Citation Shuman, CFVrang, LDanielson, UH Improved structure-activity relationship analysis of HIV-1 protease inhibitors using interaction kinetic data. J Med Chem47:5953-61 (2004) 
 
Gag-Pol polyprotein [489-587]
Name:Gag-Pol polyprotein [489-587]
Type:Enzyme Subunit
Mol. Mass.:10781.16
Organism:Human immunodeficiency virus type 1
Description:P04585[489-587]
Residue:99
BDBM50029770
NameBDBM50029770
Synonyms:4-amino-N-(5-methyl-isoxazol-3-yl)-benzenesulfonamide ACETYLSULFAMETHOXAZOLE CHEMBL443 GANTANOL RO 4-2130 SULFAMETHOPRIM SULFAMETHOXAZOLE SODIUM SULFATRIM-DS SULMEPRIM TRIMETH/SULFA | UROBAK
TypeSmall organic molecule
Emp. Form.C10H11N3O3S
Mol. Mass.253.278
SMILESCc1cc(NS(=O)(=O)c2ccc(N)cc2)no1