Reaction Details
TargetGag-Pol polyprotein [489-587]
LigandBDBM50156154
Substrate/Competitorn/a
Meas. Tech.ChEMBL_302137 (CHEMBL841761)
Kd 1.18±n/a nM
Citation Shuman, CFVrang, LDanielson, UH Improved structure-activity relationship analysis of HIV-1 protease inhibitors using interaction kinetic data. J Med Chem47:5953-61 (2004) 
 
Gag-Pol polyprotein [489-587]
Name:Gag-Pol polyprotein [489-587]
Type:Enzyme Subunit
Mol. Mass.:10781.16
Organism:Human immunodeficiency virus type 1
Description:P04585[489-587]
Residue:99
BDBM50156154
NameBDBM50156154
Synonyms:1,6-Bis-(2,3-dimethyl-butyrylamino)-3,4-dihydroxy-1,6-dioxo-5-(4-pyridin-2-yl-phenoxy)-hexan-2-ol anion
TypeSmall organic molecule
Emp. Form.C29H38N3O8
Mol. Mass.556.6279
SMILESCC(C)[C@H](C)C(=O)NC(=O)[C@H]([O-])[C@H](O)[C@@H](O)[C@@H](Oc1ccc(cc1)-c1ccccn1)C(=O)NC(=O)[C@@H](C)C(C)C