Reaction Details
TargetGag-Pol polyprotein [489-587]
LigandBDBM50156147
Substrate/Competitorn/a
Meas. Tech.ChEMBL_302137 (CHEMBL841761)
Kd 4.42±n/a nM
Citation Shuman, CFVrang, LDanielson, UH Improved structure-activity relationship analysis of HIV-1 protease inhibitors using interaction kinetic data. J Med Chem47:5953-61 (2004) 
 
Gag-Pol polyprotein [489-587]
Name:Gag-Pol polyprotein [489-587]
Type:Enzyme Subunit
Mol. Mass.:10781.16
Organism:Human immunodeficiency virus type 1
Description:P04585[489-587]
Residue:99
BDBM50156147
NameBDBM50156147
Synonyms:1-(2,3-Dimethyl-butyrylamino)-3,4-dihydroxy-5-(2-hydroxy-indan-1-ylcarbamoyl)-1-oxo-5-phenoxy-pentan-2-ol anion
TypeSmall organic molecule
Emp. Form.C27H33N2O8
Mol. Mass.513.5601
SMILESCC(C)[C@H](C)C(=O)NC(=O)[C@H]([O-])[C@H](O)[C@@H](O)[C@@H](Oc1ccccc1)C(=O)NC1[C@@H](O)Cc2ccccc12