Reaction Details
TargetType-2 angiotensin II receptor
LigandBDBM50156174
Substrate/Competitorn/a
Meas. Tech.ChEMBL_303611 (CHEMBL829700)
Ki 7.1±n/a nM
Citation Wan, YWallinder, CPlouffe, BBeaudry, HMahalingam, AKWu, XJohansson, BHolm, MBotoros, MKarlén, APettersson, ANyberg, FFändriks, LGallo-Payet, NHallberg, AAlterman, M Design, synthesis, and biological evaluation of the first selective nonpeptide AT2 receptor agonist. J Med Chem47:5995-6008 (2004) 
 
Type-2 angiotensin II receptor
Name:Type-2 angiotensin II receptor
Type:Enzyme Catalytic Domain
Mol. Mass.:41201.61
Organism:Homo sapiens (Human)
Description:Angiotensin II, central 0 0::P50052
Residue:363
BDBM50156174
NameBDBM50156174
Synonyms:CHEMBL190811 | butyl (5-isobutylthien-2-yl)sulfonylcarbamate derivative
TypeSmall organic molecule
Emp. Form.C26H30N4O4S2
Mol. Mass.526.671
SMILESCCCCOC(=O)NS(=O)(=O)c1sc(CC(C)C)cc1-c1ccc(Cn2cnc3cccnc23)cc1