Reaction Details
TargetType-2 angiotensin II receptor
LigandBDBM50049189
Substrate/Competitorn/a
Meas. Tech.ChEMBL_303611 (CHEMBL829700)
Ki 2.8±n/a nM
Citation Wan, YWallinder, CPlouffe, BBeaudry, HMahalingam, AKWu, XJohansson, BHolm, MBotoros, MKarlén, APettersson, ANyberg, FFändriks, LGallo-Payet, NHallberg, AAlterman, M Design, synthesis, and biological evaluation of the first selective nonpeptide AT2 receptor agonist. J Med Chem47:5995-6008 (2004) 
 
Type-2 angiotensin II receptor
Name:Type-2 angiotensin II receptor
Type:Enzyme Catalytic Domain
Mol. Mass.:41201.61
Organism:Homo sapiens (Human)
Description:Angiotensin II, central 0 0::P50052
Residue:363
BDBM50049189
NameBDBM50049189
Synonyms:3-[4-(2-Ethyl-57-dimethyl-imidazo[45-b]pyridin-3-ylmethyl)-phenyl]-5-isobutyl-thiophene-2-sulfonic acid butyloxycarbonylamide(L-162313) L-162313 | butyl 3-(4-((2-ethyl-5,7-dimethyl-3H-imidazo[4,5-b]pyridin-3-yl)methyl)phenyl)-5-isobutylthiophen-2-ylsulfonylcarbamate
TypeSmall organic molecule
Emp. Form.C30H38N4O4S2
Mol. Mass.582.777
SMILESCCCCOC(=O)NS(=O)(=O)c1sc(CC(C)C)cc1-c1ccc(Cn2c(CC)nc3c(C)cc(C)nc23)cc1