Reaction Details
TargetGenome polyprotein
LigandBDBM30406
Substrate/Competitorn/a
Meas. Tech.ChEMBL_305160 (CHEMBL832751)
IC50 800±n/a nM
Citation Gordon, CPKeller, PA Control of hepatitis C: a medicinal chemistry perspective. J Med Chem48:1-20 (2005) 
 
Genome polyprotein
Name:Genome polyprotein
Type:Protein
Mol. Mass.:327266.82
Organism:Hepatitis C virus (HCV)
Description:P26664
Residue:3011
BDBM30406
NameBDBM30406
Synonyms:CHEMBL176058 | benzo[1,2,4]thiadiazine-1,1-dioxide, 1
TypeSmall organic molecule
Emp. Form.C21H21N3O4S
Mol. Mass.411.474
SMILESCC(C)CCn1c2ccccc2c(O)c(C2=Nc3ccccc3S(=O)(=O)N2)c1=O