Reaction Details
TargetGenome polyprotein
LigandBDBM50370548
Substrate/Competitorn/a
Meas. Tech.ChEMBL_305077 (CHEMBL832708)
IC50 100±n/a nM
Citation Gordon, CPKeller, PA Control of hepatitis C: a medicinal chemistry perspective. J Med Chem48:1-20 (2005) 
 
Genome polyprotein
Name:Genome polyprotein
Type:Protein
Mol. Mass.:67067.41
Organism:Hepatitis C virus
Description:A3EZI9
Residue:631
BDBM50370548
NameBDBM50370548
Synonyms:NOGALAMYCIN
TypeSmall organic molecule
Emp. Form.C39H49NO16
Mol. Mass.787.8035
SMILESCO[C@H]1[C@H](C)O[C@@H](O[C@H]2C[C@](C)(O)[C@H](C(=O)OC)c3cc4C(=O)c5c6O[C@@H]7O[C@@](C)([C@H](O)[C@H]([C@@H]7O)N(C)C)c6cc(O)c5C(=O)c4c(O)c23)[C@H](OC)[C@]1(C)OC