Reaction Details
TargetGenome polyprotein
LigandBDBM50110121
Substrate/Competitorn/a
Meas. Tech.ChEMBL_302596 (CHEMBL838564)
Ki 10±n/a nM
Citation Gordon, CPKeller, PA Control of hepatitis C: a medicinal chemistry perspective. J Med Chem48:1-20 (2005) 
 
Genome polyprotein
Name:Genome polyprotein
Type:Protein
Mol. Mass.:67067.41
Organism:Hepatitis C virus
Description:A3EZI9
Residue:631
BDBM50110121
NameBDBM50110121
Synonyms:3-[2-(2-{2-[2-(2-Acetylamino-3-carboxy-propionylamino)-4-carboxy-butyrylamino]-3,3-diphenyl-propionylamino}-4-carboxy-butyrylamino)-3-cyclohexyl-propionylamino]-5,5-difluoro-2-oxo-pentanoic acid CHEMBL349186
TypeSmall organic molecule
Emp. Form.C45H56F2N6O15
Mol. Mass.958.9541
SMILESCC(=O)N[C@@H](CC(O)=O)C(=O)N[C@@H](CCC(O)=O)C(=O)N[C@@H](C(c1ccccc1)c1ccccc1)C(=O)N[C@@H](CCC(O)=O)C(=O)N[C@@H](CC1CCCCC1)C(=O)N[C@@H](CC(F)F)C(=O)C(O)=O