Reaction Details
TargetGenome polyprotein
LigandBDBM50158813
Substrate/Competitorn/a
Meas. Tech.ChEMBL_305214 (CHEMBL832467)
IC50 51±n/a nM
Citation Gordon, CPKeller, PA Control of hepatitis C: a medicinal chemistry perspective. J Med Chem48:1-20 (2005) 
 
Genome polyprotein
Name:Genome polyprotein
Type:Protein
Mol. Mass.:67067.41
Organism:Hepatitis C virus
Description:A3EZI9
Residue:631
BDBM50158813
NameBDBM50158813
Synonyms:AcAsp-Glu-Cha-Val-Prb-Cpg | CHEMBL360983
TypeSmall organic molecule
Emp. Form.C41H58N6O13
Mol. Mass.842.9316
SMILESCC(C)[C@H](NC(=O)[C@H](CC1CCCCC1)NC(=O)[C@H](CCC(O)=O)NC(=O)[C@H](CC(O)=O)NC(C)=O)C(=O)N1C[C@H](C[C@H]1C(=O)NC1(CC1)C(O)=O)OCc1ccccc1