Reaction Details
TargetCytochrome P450 2E1
LigandBDBM12341
Substrate/Competitorn/a
Meas. Tech.ChEMBL_305743 (CHEMBL829415)
IC50 40200±n/a nM
Citation Denton, TTZhang, XCashman, JR 5-substituted, 6-substituted, and unsubstituted 3-heteroaromatic pyridine analogues of nicotine as selective inhibitors of cytochrome P-450 2A6. J Med Chem48:224-39 (2005) 
 
Cytochrome P450 2E1
Name:Cytochrome P450 2E1
Type:Enzyme
Mol. Mass.:56860.34
Organism:Homo sapiens (Human)
Description:P05181
Residue:493
BDBM12341
NameBDBM12341
Synonyms:CHEMBL178681 US8609708, 1 [5-(pyridin-3-yl)thiophen-2-yl]methanamine | nicotine 3-heteroaromatic analogue 1a
TypeSmall organic molecule
Emp. Form.C10H10N2S
Mol. Mass.190.265
SMILESNCc1ccc(s1)-c1cccnc1