Reaction Details
TargetCytochrome P450 2E1
LigandBDBM50158920
Substrate/Competitorn/a
Meas. Tech.ChEMBL_305743 (CHEMBL829415)
IC50 4100±n/a nM
Citation Denton, TTZhang, XCashman, JR 5-substituted, 6-substituted, and unsubstituted 3-heteroaromatic pyridine analogues of nicotine as selective inhibitors of cytochrome P-450 2A6. J Med Chem48:224-39 (2005) 
 
Cytochrome P450 2E1
Name:Cytochrome P450 2E1
Type:Enzyme
Mol. Mass.:56860.34
Organism:Homo sapiens (Human)
Description:P05181
Residue:493
BDBM50158920
NameBDBM50158920
Synonyms:3-(3-Methyl-1H-imidazol-4-yl)-pyridine | CHEMBL179399
TypeSmall organic molecule
Emp. Form.C9H10N3
Mol. Mass.160.1953
SMILESC[n+]1c[nH]cc1-c1cccnc1