Reaction Details
TargetCytochrome P450 2C19
LigandBDBM12357
Substrate/Competitorn/a
Meas. Tech.ChEMBL_305767 (CHEMBL827104)
IC50 53500±n/a nM
Citation Denton, TTZhang, XCashman, JR 5-substituted, 6-substituted, and unsubstituted 3-heteroaromatic pyridine analogues of nicotine as selective inhibitors of cytochrome P-450 2A6. J Med Chem48:224-39 (2005) 
 
Cytochrome P450 2C19
Name:Cytochrome P450 2C19
Type:Enzyme
Mol. Mass.:55935.47
Organism:Homo sapiens (Human)
Description:P33261
Residue:490
BDBM12357
NameBDBM12357
Synonyms:3-(1H-imidazol-4-yl)pyridine JMC514968 Compound 7 US8609708,14 | nicotine 3-heteroaromatic analogue 10
TypeSmall organic molecule
Emp. Form.C8H7N3
Mol. Mass.145.1613
SMILESc1nc(c[nH]1)-c1cccnc1