Reaction Details
TargetCytochrome P450 2E1
LigandBDBM12351
Substrate/Competitorn/a
Meas. Tech.ChEMBL_305743 (CHEMBL829415)
IC50 6900±n/a nM
Citation Denton, TTZhang, XCashman, JR 5-substituted, 6-substituted, and unsubstituted 3-heteroaromatic pyridine analogues of nicotine as selective inhibitors of cytochrome P-450 2A6. J Med Chem48:224-39 (2005) 
 
Cytochrome P450 2E1
Name:Cytochrome P450 2E1
Type:Enzyme
Mol. Mass.:56860.34
Organism:Homo sapiens (Human)
Description:P05181
Residue:493
BDBM12351
NameBDBM12351
Synonyms:3-(3-methylthiophen-2-yl)pyridine US8609708, 4 | nicotine 3-heteroaromatic analogue 4
TypeSmall organic molecule
Emp. Form.C10H9NS
Mol. Mass.175.25
SMILESCc1ccsc1-c1cccnc1