Reaction Details
TargetSigma non-opioid intracellular receptor 1
LigandBDBM50159009
Substrate/Competitorn/a
Meas. Tech.ChEMBL_303294 (CHEMBL827427)
Ki 1.4±n/a nM
Citation Costantino, LGandolfi, FSorbi, CFranchini, SPrezzavento, OVittorio, FRonsisvalle, GLeonardi, APoggesi, EBrasili, L Synthesis and structure-activity relationships of 1-aralkyl-4-benzylpiperidine and 1-aralkyl-4-benzylpiperazine derivatives as potent sigma ligands. J Med Chem48:266-73 (2005) 
 
Sigma non-opioid intracellular receptor 1
Name:Sigma non-opioid intracellular receptor 1
Type:Enzyme Catalytic Domain
Mol. Mass.:25124.85
Organism:Homo sapiens (Human)
Description:Q99720
Residue:223
BDBM50159009
NameBDBM50159009
Synonyms:2-(4-Benzyl-piperazin-1-ylmethyl)-3,4-dihydro-2H-naphthalen-1-one | CHEMBL425867
TypeSmall organic molecule
Emp. Form.C22H26N2O
Mol. Mass.334.4546
SMILESO=C1C(CN2CCN(Cc3ccccc3)CC2)CCc2ccccc12