Reaction Details
TargetSigma non-opioid intracellular receptor 1
LigandBDBM50159020
Substrate/Competitorn/a
Meas. Tech.ChEMBL_303294 (CHEMBL827427)
Ki 2.52±n/a nM
Citation Costantino, LGandolfi, FSorbi, CFranchini, SPrezzavento, OVittorio, FRonsisvalle, GLeonardi, APoggesi, EBrasili, L Synthesis and structure-activity relationships of 1-aralkyl-4-benzylpiperidine and 1-aralkyl-4-benzylpiperazine derivatives as potent sigma ligands. J Med Chem48:266-73 (2005) 
 
Sigma non-opioid intracellular receptor 1
Name:Sigma non-opioid intracellular receptor 1
Type:Enzyme Catalytic Domain
Mol. Mass.:25124.85
Organism:Homo sapiens (Human)
Description:Q99720
Residue:223
BDBM50159020
NameBDBM50159020
Synonyms:4-Benzyl-1-(1,2,3,4-tetrahydro-naphthalen-2-ylmethyl)-piperidine | CHEMBL180327
TypeSmall organic molecule
Emp. Form.C23H29N
Mol. Mass.319.4831
SMILESC(C1CCc2ccccc2C1)N1CCC(Cc2ccccc2)CC1