Reaction Details
TargetComplement C3
LigandBDBM50159056
Substrate/Competitorn/a
Meas. Tech.ChEMBL_305250 (CHEMBL833507)
IC50 53600±n/a nM
Citation Mallik, BKatragadda, MSpruce, LACarafides, CTsokos, CGMorikis, DLambris, JD Design and NMR characterization of active analogues of compstatin containing non-natural amino acids. J Med Chem48:274-86 (2005) 
 
Complement C3
Name:Complement C3
Type:Enzyme
Mol. Mass.:187142.34
Organism:Homo sapiens (Human)
Description:P01024
Residue:1663
BDBM50159056
NameBDBM50159056
Synonyms:CHEMBL265136 | I[CVVQDWGHHRC]T-NH2
TypeSmall organic molecule
Emp. Form.C66H99N23O17S2
Mol. Mass.1550.766
SMILESCC[C@H](C)[C@H](N)C(=O)N[C@H]1CSSC[C@H](NC(=O)[C@H](CCCNC(N)=N)NC(=O)[C@@H](Cc2cnc[nH]2)NC(=O)[C@H](Cc2cnc[nH]2)NC(=O)CNC(=O)[C@H](Cc2c[nH]c3ccccc23)NC(=O)[C@@H](CC(O)=O)NC(=O)[C@H](CCC(N)=O)NC(=O)[C@H](NC(=O)[C@@H](NC1=O)C(C)C)C(C)C)C(=O)N[C@@H]([C@@H](C)O)C(N)=O