Reaction Details
TargetComplement C3
LigandBDBM50159067
Substrate/Competitorn/a
Meas. Tech.ChEMBL_305250 (CHEMBL833507)
IC50 9600±n/a nM
Citation Mallik, BKatragadda, MSpruce, LACarafides, CTsokos, CGMorikis, DLambris, JD Design and NMR characterization of active analogues of compstatin containing non-natural amino acids. J Med Chem48:274-86 (2005) 
 
Complement C3
Name:Complement C3
Type:Enzyme
Mol. Mass.:187142.34
Organism:Homo sapiens (Human)
Description:P01024
Residue:1663
BDBM50159067
NameBDBM50159067
Synonyms:Ac-I[CV(Yphs)QDWGAHRC]I-NH2 | CHEMBL268083
TypeSmall organic molecule
Emp. Form.C71H104N21O21PS2
Mol. Mass.1682.817
SMILESCC[C@H](C)[C@H](NC(=O)[C@@H]1CSSC[C@H](NC(=O)[C@@H](NC(C)=O)[C@@H](C)CC)C(=O)N[C@@H](C(C)C)C(=O)N[C@@H](Cc2ccc(OP(O)(O)=O)cc2)C(=O)N[C@@H](CCC(N)=O)C(=O)N[C@H](CC(O)=O)C(=O)N[C@@H](Cc2c[nH]c3ccccc23)C(=O)NCC(=O)N[C@@H](C)C(=O)N[C@H](Cc2cnc[nH]2)C(=O)N[C@@H](CCCNC(N)=N)C(=O)N1)C(N)=O