Reaction Details
TargetHistamine H3 receptor
LigandBDBM50158608
Substrate/Competitorn/a
Meas. Tech.ChEMBL_303685 (CHEMBL828754)
Ki 0.35±n/a nM
Citation Cowart, MFaghih, RCurtis, MPGfesser, GABennani, YLBlack, LAPan, LMarsh, KCSullivan, JPEsbenshade, TAFox, GBHancock, AA 4-(2-[2-(2(R)-methylpyrrolidin-1-yl)ethyl]benzofuran-5-yl)benzonitrile and related 2-aminoethylbenzofuran H3 receptor antagonists potently enhance cognition and attention. J Med Chem48:38-55 (2005) 
 
Histamine H3 receptor
Name:Histamine H3 receptor
Type:G Protein-Coupled Receptor (GPCR)
Mol. Mass.:48691.47
Organism:Homo sapiens (Human)
Description:Binding assays were using CHO cells stably expressing hH3R receptors.
Residue:445
BDBM50158608
NameBDBM50158608
Synonyms:(4-Chloro-3-methyl-phenyl)-{2-[2-((R)-2-methyl-pyrrolidin-1-yl)-ethyl]-benzofuran-5-yl}-methanone | CHEMBL179372
TypeSmall organic molecule
Emp. Form.C23H24ClNO2
Mol. Mass.381.895
SMILESC[C@@H]1CCCN1CCc1cc2cc(ccc2o1)C(=O)c1ccc(Cl)c(C)c1