Reaction Details
Target5-hydroxytryptamine receptor 1A
LigandBDBM86708
Substrate/Competitorn/a
Meas. Tech.ChEMBL_303671 (CHEMBL830432)
Ki 0.9±n/a nM
Citation Childers, WEAbou-Gharbia, MAKelly, MGAndree, THHarrison, BLHo, DMHornby, GHuryn, DMPotestio, LRosenzweig-Lipson, SJSchmid, JSmith, DLSukoff, SJZhang, GSchechter, LE Synthesis and biological evaluation of benzodioxanylpiperazine derivatives as potent serotonin 5-HT(1A) antagonists: the discovery of Lecozotan. J Med Chem48:3467-70 (2005) 
 
5-hydroxytryptamine receptor 1A
Name:5-hydroxytryptamine receptor 1A
Type:n/a
Mol. Mass.:46122.49
Organism:Homo sapiens (Human)
Description:n/a
Residue:422
BDBM86708
NameBDBM86708
Synonyms:CAS_146714-97-8 CHEMBL514874 NSC_104911 | WAY 100,635
TypeSmall organic molecule
Emp. Form.C25H34N4O2
Mol. Mass.422.5631
SMILESCOc1ccccc1N1CCN(CCN(C(=O)C2CCCCC2)c2ccccn2)CC1