Reaction Details
TargetAcetylcholine receptor subunit alpha/beta/delta/gamma
LigandBDBM50166907
Substrate/Competitorn/a
Meas. Tech.ChEMBL_303631 (CHEMBL828841)
Ki 690±n/a nM
Citation Coe, JWBrooks, PRVetelino, MGWirtz, MCArnold, EPHuang, JSands, SBDavis, TILebel, LAFox, CBShrikhande, AHeym, JHSchaeffer, ERollema, HLu, YMansbach, RSChambers, LKRovetti, CCSchulz, DWTingley, FDO'Neill, BT Varenicline: an alpha4beta2 nicotinic receptor partial agonist for smoking cessation. J Med Chem48:3474-7 (2005) 
 
Acetylcholine receptor subunit alpha/beta/delta/gamma
Name:Acetylcholine receptor subunit alpha/beta/delta/gamma
Type:n/a
Mol. Mass.:n/a
Description:ASSAY_ID of EBI is 143080
Components:This complex has 4 components.
Component 1
Name:Acetylcholine receptor subunit beta
Synonyms:ACHB_TETCF CHRNB1
Type:PROTEIN
Mol. Mass.:56146.98
Organism:Torpedo californica
Description:EBI_19626
Residue:493
Component 2
Name:Acetylcholine receptor subunit gamma
Synonyms:ACHG_TETCF CHRNG
Type:PROTEIN
Mol. Mass.:58151.68
Organism:Torpedo californica
Description:EBI_19662
Residue:506
Component 3
Name:Acetylcholine receptor subunit alpha
Synonyms:ACHA_TETCF Acetylcholine receptor protein alpha chain | CHRNA1
Type:PROTEIN
Mol. Mass.:52735.09
Organism:Torpedo californica
Description:ChEMBL_216981
Residue:461
Component 4
Name:Acetylcholine receptor subunit delta
Synonyms:ACHD_TETCF Acetylcholine receptor protein delta chain | chrnd
Type:PROTEIN
Mol. Mass.:59885.01
Organism:Torpedo californica
Description:ChEMBL_142744
Residue:522
BDBM50166907
NameBDBM50166907
Synonyms:4-nitro-10-azatricyclo[6.3.1.02,7]dodeca-2(7),3,5-triene; hydrochloride | CHEMBL535600
TypeSmall organic molecule
Emp. Form.C11H12N2O2
Mol. Mass.204.2252
SMILES[O-][N+](=O)c1ccc2C3CC(CNC3)c2c1