Reaction Details
TargetAcetylcholine receptor subunit alpha/beta/delta/gamma
LigandBDBM82070
Substrate/Competitorn/a
Meas. Tech.ChEMBL_303631 (CHEMBL828841)
Ki 6270±n/a nM
Citation Coe, JWBrooks, PRVetelino, MGWirtz, MCArnold, EPHuang, JSands, SBDavis, TILebel, LAFox, CBShrikhande, AHeym, JHSchaeffer, ERollema, HLu, YMansbach, RSChambers, LKRovetti, CCSchulz, DWTingley, FDO'Neill, BT Varenicline: an alpha4beta2 nicotinic receptor partial agonist for smoking cessation. J Med Chem48:3474-7 (2005) 
 
Acetylcholine receptor subunit alpha/beta/delta/gamma
Name:Acetylcholine receptor subunit alpha/beta/delta/gamma
Type:n/a
Mol. Mass.:n/a
Description:ASSAY_ID of EBI is 143080
Components:This complex has 4 components.
Component 1
Name:Acetylcholine receptor subunit beta
Synonyms:ACHB_TETCF CHRNB1
Type:PROTEIN
Mol. Mass.:56146.98
Organism:Torpedo californica
Description:EBI_19626
Residue:493
Component 2
Name:Acetylcholine receptor subunit gamma
Synonyms:ACHG_TETCF CHRNG
Type:PROTEIN
Mol. Mass.:58151.68
Organism:Torpedo californica
Description:EBI_19662
Residue:506
Component 3
Name:Acetylcholine receptor subunit alpha
Synonyms:ACHA_TETCF Acetylcholine receptor protein alpha chain | CHRNA1
Type:PROTEIN
Mol. Mass.:52735.09
Organism:Torpedo californica
Description:ChEMBL_216981
Residue:461
Component 4
Name:Acetylcholine receptor subunit delta
Synonyms:ACHD_TETCF Acetylcholine receptor protein delta chain | chrnd
Type:PROTEIN
Mol. Mass.:59885.01
Organism:Torpedo californica
Description:ChEMBL_142744
Residue:522
BDBM82070
NameBDBM82070
Synonyms:CAS_29790-52-1 Nicotine-D salicylate US9303017, Nicotine
Typen/a
Emp. Form.C10H14N2
Mol. Mass.162.2316
SMILESCN1CCC[C@H]1c1cccnc1