Reaction Details
Target5-hydroxytryptamine receptor 3A/3B
LigandBDBM50167011
Substrate/Competitorn/a
Meas. Tech.ChEMBL_303681 (CHEMBL830441)
Ki 0.24±n/a nM
Citation Cappelli, AGallelli, AManini, MAnzini, MMennuni, LMakovec, FMenziani, MCAlcaro, SOrtuso, FVomero, S Further studies on the interaction of the 5-hydroxytryptamine3 (5-HT3) receptor with arylpiperazine ligands. development of a new 5-HT3 receptor ligand showing potent acetylcholinesterase inhibitory properties. J Med Chem48:3564-75 (2005) 
 
5-hydroxytryptamine receptor 3A/3B
Name:5-hydroxytryptamine receptor 3A/3B
Type:n/a
Mol. Mass.:n/a
Description:ASSAY_ID of EBI is 2974
Components:This complex has 2 components.
Component 1
Name:5-hydroxytryptamine receptor 3B
Synonyms:5HT3B_RAT Serotonin (5-HT) receptor
Type:PROTEIN
Mol. Mass.:50328.78
Organism:Rattus norvegicus
Description:EBI_11885
Residue:437
Component 2
Name:5-hydroxytryptamine receptor 3A
Synonyms:5-HT3 5HT3A_RAT Htr3 Serotonin (5-HT) receptor | Zacopride site-R
Type:Enzyme Catalytic Domain
Mol. Mass.:55428.70
Organism:RAT
Description:5-HT3 HTR3A RAT::P35563
Residue:483
BDBM50167011
NameBDBM50167011
Synonyms:4-(4-Methyl-piperazin-1-yl)-2,3-dihydro-1H-cyclopenta[c]quinoline | CHEMBL64078
TypeSmall organic molecule
Emp. Form.C17H21N3
Mol. Mass.267.3687
SMILESCN1CCN(CC1)c1nc2ccccc2c2CCCc12