Reaction Details
TargetD(2) dopamine receptor
LigandBDBM50071959
Substrate/Competitorn/a
Meas. Tech.ChEMBL_303064 (CHEMBL828890)
Ki 698±n/a nM
Citation Newman, AHGrundt, PNader, MA Dopamine D3 receptor partial agonists and antagonists as potential drug abuse therapeutic agents. J Med Chem48:3663-79 (2005) 
 
D(2) dopamine receptor
Name:D(2) dopamine receptor
Type:Cell-surface receptors
Mol. Mass.:50647.10
Organism:Homo sapiens (Human)
Description:P14416
Residue:443
BDBM50071959
NameBDBM50071959
Synonyms:9H-Fluorene-2-carboxylic acid {4-[4-(2,3-dichloro-phenyl)-piperazin-1-yl]-butyl}-amide N-(4-(4-(2,3-dichlorophenyl)piperazin-1-yl)butyl)-9H-fluorene-2-carboxamide
TypeSmall organic molecule
Emp. Form.C28H29Cl2N3O
Mol. Mass.494.455
SMILESClc1cccc(N2CCN(CCCCNC(=O)c3ccc-4c(Cc5ccccc-45)c3)CC2)c1Cl