Reaction Details
TargetD(4) dopamine receptor
LigandBDBM50167930
Substrate/Competitorn/a
Meas. Tech.ChEMBL_303714 (CHEMBL829049)
Ki 3.3±n/a nM
Citation Schlotter, KBoeckler, FHübner, HGmeiner, P Fancy bioisosteres: metallocene-derived G-protein-coupled receptor ligands with subnanomolar binding affinity and novel selectivity profiles. J Med Chem48:3696-9 (2005) 
 
D(4) dopamine receptor
Name:D(4) dopamine receptor
Type:Enzyme
Mol. Mass.:48373.19
Organism:Homo sapiens (Human)
Description:P21917
Residue:419
BDBM50167930
NameBDBM50167930
Synonyms:2-{1-ferra-1,1'-spirobi[pentacyclo[2.2.0.0^{1,3}.0^{1,5}.0^{2,6}]hexane]-2,2',4,4'-tetraen-6-yl}-N-{4-[4-(2-methoxyphenyl)piperazin-1-yl]butyl}acetamide | CHEMBL425731
TypeSmall organic molecule
Emp. Form.C27H27FeN3O2
Mol. Mass.481.367
SMILES[Fe]123456789C%10=C1C2=C3C4%10CC(=O)NCCCCN1CCN(c2c(cccc2)OC)CC1.C51=C6C7C8=C91