Reaction Details
TargetEndolysin [L99A]
LigandBDBM50167939
Substrate/Competitorn/a
Meas. Tech.ChEMBL_302213 (CHEMBL826986)
Kd 175000±n/a nM
Citation Graves, APBrenk, RShoichet, BK Decoys for docking. J Med Chem48:3714-28 (2005) 
 
Endolysin [L99A]
Name:Endolysin [L99A]
Type:n/a
Mol. Mass.:18657.83
Organism:Enterobacteria phage T4
Description:P00720(L99A)
Residue:164
BDBM50167939
NameBDBM50167939
Synonyms:3,4-DNH BM 613 Benzine Bicarburet of hydrogen Cc-34,(+/-) Mineral naphtha Pyrobenzol [6]annulene benzole erythro-Phenyl-2-piperidyl-carbinol,(-) trans-N, N-Dimethylphenylcyclopropylamine | trans-N-Methylphenylcyclopropylamine
TypeSmall organic molecule
Emp. Form.C6H6
Mol. Mass.78.1118
SMILESc1ccccc1