Reaction Details
TargetEndolysin [L99A]
LigandBDBM50008556
Substrate/Competitorn/a
Meas. Tech.ChEMBL_302213 (CHEMBL826986)
Kd 364000±n/a nM
Citation Graves, APBrenk, RShoichet, BK Decoys for docking. J Med Chem48:3714-28 (2005) 
 
Endolysin [L99A]
Name:Endolysin [L99A]
Type:n/a
Mol. Mass.:18657.83
Organism:Enterobacteria phage T4
Description:P00720(L99A)
Residue:164
BDBM50008556
NameBDBM50008556
Synonyms:1,3-Dimethylbenzol 3-xylene m-Xylol m-methyltoluene meta-xylene
TypeSmall organic molecule
Emp. Form.C8H10
Mol. Mass.106.165
SMILESCc1cccc(C)c1