Reaction Details
TargetEndolysin [L99A]
LigandBDBM50008567
Substrate/Competitorn/a
Meas. Tech.ChEMBL_302213 (CHEMBL826986)
Kd 422000±n/a nM
Citation Graves, APBrenk, RShoichet, BK Decoys for docking. J Med Chem48:3714-28 (2005) 
 
Endolysin [L99A]
Name:Endolysin [L99A]
Type:n/a
Mol. Mass.:18657.83
Organism:Enterobacteria phage T4
Description:P00720(L99A)
Residue:164
BDBM50008567
NameBDBM50008567
Synonyms:1,4-Dimethylbenzol 4-methyltoluene CHEMBL31561 p-dimethylbenzene para-xylene
TypeSmall organic molecule
Emp. Form.C8H10
Mol. Mass.106.165
SMILESCc1ccc(C)cc1