Reaction Details
TargetTransporter
LigandBDBM50093781
Substrate/Competitorn/a
Meas. Tech.ChEMBL_303548 (CHEMBL839753)
Ki 4.4±n/a nM
Citation Carroll, FITyagi, SBlough, BEKuhar, MJNavarro, HA Synthesis and monoamine transporter binding properties of 3alpha-(substituted phenyl)nortropane-2beta-carboxylic acid methyl esters. Norepinephrine transporter selective compounds. J Med Chem48:3852-7 (2005) 
 
Transporter
Name:Transporter
Type:PROTEIN
Mol. Mass.:66787.87
Organism:Rattus norvegicus
Description:ChEMBL_1463061
Residue:597
BDBM50093781
NameBDBM50093781
Synonyms:3-p-Tolyl-8-aza-bicyclo[3.2.1]octane CHEMBL80262
TypeSmall organic molecule
Emp. Form.C16H21NO2
Mol. Mass.259.3434
SMILESCOC(=O)C1C2CCC(CC1c1ccc(C)cc1)N2