Reaction Details
TargetReverse transcriptase/RNaseH
LigandBDBM50168060
Substrate/Competitorn/a
Meas. Tech.ChEMBL_305566 (CHEMBL827160)
IC50 4800±n/a nM
Citation Ranise, ASpallarossa, ACesarini, SBondavalli, FSchenone, SBruno, OMenozzi, GFossa, PMosti, LLa Colla, MSanna, GMurreddu, MCollu, GBusonera, BMarongiu, MEPani, ALa Colla, PLoddo, R Structure-based design, parallel synthesis, structure-activity relationship, and molecular modeling studies of thiocarbamates, new potent non-nucleoside HIV-1 reverse transcriptase inhibitor isosteres of phenethylthiazolylthiourea derivatives. J Med Chem48:3858-73 (2005) 
 
Reverse transcriptase/RNaseH
Name:Reverse transcriptase/RNaseH
Type:PROTEIN
Mol. Mass.:65229.15
Organism:Human immunodeficiency virus 1
Description:ChEMBL_1473730
Residue:566
BDBM50168060
NameBDBM50168060
Synonyms:CHEMBL195108 | N-[2-(4-Iodo-phenylthiocarbamoyloxy)-ethyl]-phthalamic acid
TypeSmall organic molecule
Emp. Form.C17H15IN2O4S
Mol. Mass.470.281
SMILESOC(=O)c1ccccc1C(=O)NCCOC(=S)Nc1ccc(I)cc1