Reaction Details
TargetReverse transcriptase/RNaseH
LigandBDBM2483
Substrate/Competitorn/a
Meas. Tech.ChEMBL_305566 (CHEMBL827160)
IC50 20±n/a nM
Citation Ranise, ASpallarossa, ACesarini, SBondavalli, FSchenone, SBruno, OMenozzi, GFossa, PMosti, LLa Colla, MSanna, GMurreddu, MCollu, GBusonera, BMarongiu, MEPani, ALa Colla, PLoddo, R Structure-based design, parallel synthesis, structure-activity relationship, and molecular modeling studies of thiocarbamates, new potent non-nucleoside HIV-1 reverse transcriptase inhibitor isosteres of phenethylthiazolylthiourea derivatives. J Med Chem48:3858-73 (2005) 
 
Reverse transcriptase/RNaseH
Name:Reverse transcriptase/RNaseH
Type:PROTEIN
Mol. Mass.:65229.15
Organism:Human immunodeficiency virus 1
Description:ChEMBL_1473730
Residue:566
BDBM2483
NameBDBM2483
Synonyms:(4S)-6-chloro-4-(2-cyclopropylethynyl)-4-(trifluoromethyl)-2,4-dihydro-1H-3,1-benzoxazin-2-one DMP-266 Efavirenz L-743,726 | Sustiva
TypeSmall organic molecule
Emp. Form.C14H9ClF3NO2
Mol. Mass.315.675
SMILESFC(F)(F)[C@]1(OC(=O)Nc2ccc(Cl)cc12)C#CC1CC1