Reaction Details
TargetCorticotropin-releasing factor receptor 1
LigandBDBM50168466
Substrate/Competitorn/a
Meas. Tech.ChEMBL_303632 (CHEMBL828842)
Ki 4.2±n/a nM
Citation Dyck, BGrigoriadis, DEGross, RSGuo, ZHaddach, MMarinkovic, DMcCarthy, JRMoorjani, MRegan, CFSaunders, JSchwaebe, MKSzabo, TWilliams, JPZhang, XBozigian, HChen, TK Potent, orally active corticotropin-releasing factor receptor-1 antagonists containing a tricyclic pyrrolopyridine or pyrazolopyridine core. J Med Chem48:4100-10 (2005) 
 
Corticotropin-releasing factor receptor 1
Name:Corticotropin-releasing factor receptor 1
Type:Enzyme
Mol. Mass.:50744.31
Organism:Homo sapiens (Human)
Description:P34998
Residue:444
BDBM50168466
NameBDBM50168466
Synonyms:1-(2,4-Dichloro-phenyl)-7-methyl-5-(1-propyl-butyl)-1,3,4,5-tetrahydro-1,5,8-triaza-acenaphthylene | CHEMBL364016
TypeSmall organic molecule
Emp. Form.C23H27Cl2N3
Mol. Mass.416.387
SMILESCCCC(CCC)N1CCc2cn(-c3ccc(Cl)cc3Cl)c3nc(C)cc1c23