Reaction Details
TargetCorticotropin-releasing factor receptor 1
LigandBDBM50168469
Substrate/Competitorn/a
Meas. Tech.ChEMBL_303632 (CHEMBL828842)
Ki 16±n/a nM
Citation Dyck, BGrigoriadis, DEGross, RSGuo, ZHaddach, MMarinkovic, DMcCarthy, JRMoorjani, MRegan, CFSaunders, JSchwaebe, MKSzabo, TWilliams, JPZhang, XBozigian, HChen, TK Potent, orally active corticotropin-releasing factor receptor-1 antagonists containing a tricyclic pyrrolopyridine or pyrazolopyridine core. J Med Chem48:4100-10 (2005) 
 
Corticotropin-releasing factor receptor 1
Name:Corticotropin-releasing factor receptor 1
Type:Enzyme
Mol. Mass.:50744.31
Organism:Homo sapiens (Human)
Description:P34998
Residue:444
BDBM50168469
NameBDBM50168469
Synonyms:1-(4-Chloro-2,6-dimethyl-phenyl)-5-(1-methoxymethyl-propyl)-7-methyl-1,3,4,5-tetrahydro-1,5,8-triaza-acenaphthylene | CHEMBL372009
TypeSmall organic molecule
Emp. Form.C23H28ClN3O
Mol. Mass.397.941
SMILESCCC(COC)N1CCc2cn(-c3c(C)cc(Cl)cc3C)c3nc(C)cc1c23