Reaction Details
TargetCorticotropin-releasing factor receptor 1
LigandBDBM50116105
Substrate/Competitorn/a
Meas. Tech.ChEMBL_303632 (CHEMBL828842)
Ki 7.8±n/a nM
Citation Dyck, BGrigoriadis, DEGross, RSGuo, ZHaddach, MMarinkovic, DMcCarthy, JRMoorjani, MRegan, CFSaunders, JSchwaebe, MKSzabo, TWilliams, JPZhang, XBozigian, HChen, TK Potent, orally active corticotropin-releasing factor receptor-1 antagonists containing a tricyclic pyrrolopyridine or pyrazolopyridine core. J Med Chem48:4100-10 (2005) 
 
Corticotropin-releasing factor receptor 1
Name:Corticotropin-releasing factor receptor 1
Type:Enzyme
Mol. Mass.:50744.31
Organism:Homo sapiens (Human)
Description:P34998
Residue:444
BDBM50116105
NameBDBM50116105
Synonyms:3-(6-(dimethylamino)-4-methylpyridin-3-yl)-2,5-dimethyl-N,N-dipropylpyrazolo[1,5-a]pyrimidin-7-amine R-121919 [3-(6-Dimethylamino-4-methyl-pyridin-3-yl)-2,5-dimethyl-pyrazolo[1,5-a]pyrimidin-7-yl]-dipropyl-amine
TypeSmall organic molecule
Emp. Form.C22H32N6
Mol. Mass.380.5297
SMILESCCCN(CCC)c1cc(C)nc2c(c(C)nn12)-c1cnc(cc1C)N(C)C